{"text_format":"1","workbook":"xlsx","n_sheets":9,"sheets":["Principal","Mapa_Estrategico","OBJ_Global","Detalle_Objetivos","Panel_BCI","Hoja6","Hoja7","F02","Obj_Ejecutivos"],"not_rendered":{"charts":2,"images":20,"macros":1,"external_links":0,"defined_names":12,"comments":0,"pivot_tables":4},"unopened":[],"bounds":{"document_bytes":16777216,"sheet_cells":100000,"rows_first":2000,"rows_last":500,"rows_between":2000,"halvings":0,"cell_chars":16384,"cell_head_chars":4096},"cells_cut":0,"cells_raw":0,"read":"whole","date_system":"1900"}

{"sheet":"Principal","index":0,"n_rows":25,"n_cols":11,"rows_kept":25,"cut":false,"hidden":false,"merged":[[22,3,22,4],[22,15,22,16],[23,3,23,4],[24,3,24,4],[17,3,17,4],[18,3,18,4],[18,15,18,16],[19,3,19,4],[19,15,19,16],[21,15,21,16],[20,2,20,6]]}
[]
[]
[]
[]
[]
[]
[]
[null,null,null,null,null,null,null,null,null,null,"MISIÓN"]
{"$rows_left_out":18}
{"sheet":"Mapa_Estrategico","index":1,"n_rows":25,"n_cols":4,"rows_kept":25,"cut":false,"hidden":true,"merged":[[17,3,17,4],[22,3,22,4],[22,15,22,16],[23,3,23,4],[24,3,24,4],[18,3,18,4],[18,15,18,16],[19,3,19,4],[19,15,19,16],[21,15,21,16],[20,2,20,6]]}
[]
[]
[]
[]
[]
[]
[]
[]
{"$rows_left_out":18}
{"sheet":"OBJ_Global","index":2,"n_rows":33,"n_cols":26,"rows_kept":33,"cut":false,"hidden":true,"merged":[[30,2,30,3],[22,2,22,3],[15,2,15,3],[17,2,17,3],[25,2,25,3],[27,2,27,3],[0,14,0,15],[23,2,23,3],[5,13,5,14],[3,15,3,16],[10,2,10,3],[4,15,4,16],[5,4,5,5],[20,4,20,5],[20,13,20,14]]}
[null,null,null,"2013-01-22"]
[null,null,null,"2013-01-22"]
[null,null,null,null,null,null,null,null,null,null,null,null,null,null,{"$f":"HLOOKUP($Z$5,Panel_BCI!$S$6:$EP$82,2,FALSE)","v":{"$error":"#N/A"}}]
[null,null,null,null,null,null,null,null,null,null,null,null,null,"Fecha de consulta",{"$f":"+DAY(Z4)","v":25},{"$f":"VLOOKUP(MONTH(Z4),'F02'!B74:C85,2)","v":"Enero"},null,{"$f":"YEAR(Z4)","v":2014},null,null,null,null,null,null,null,"25-01-2014"]
[null,null,null,null,null,null,null,null,null,null,null,null,null,null,null,null,null,null,null,null,null,null,null,null,null,{"$f":"+R4&P4&O4","v":"2014Enero25"}]
[null,null,null,null,{"$f":"+\"al: \"&TEXT($Z$4,\"aaa/dd/mmmm/yyyy\")","v":"al: sáb/25/enero/2014"},null,null,null,null,null,null,null,null,{"$f":"+\"al: \"&TEXT($Z$4,\"aaa/dd/mmmm/yyyy\")","v":"al: sáb/25/enero/2014"},null,null,null,null,null,null,null,null,null,null,null,"2013-10-25"]
[null,null,null,null,"Actual acumulado","Meta Proporcional","Meta periodo","Unidad","Frec.","Estado actual","?",null,null,"Actual acumulado","Meta Proporcional","Meta periodo","Unidad","Frec.","Estado actual",null,null,null,null,null,null,"2014-01-25"]
[null,null,{"$f":"+Panel_BCI!C8","v":"Obtener Rentabilidad Operativa para  Sucursal Bancaria"},null,null,null,null,null,null,null,null,null,{"$f":"+Panel_BCI!C32","v":"Lograr Satisfacción del cliente"},null,null,null,null,null,null,null,null,null,null,null,null,41664]
{"$rows_left_out":26}
{"sheet":"Detalle_Objetivos","index":3,"n_rows":30,"n_cols":38,"rows_kept":30,"cut":false,"hidden":true,"merged":[[9,22,10,22],[9,21,10,21],[23,3,23,5],[24,3,24,5],[21,3,21,5],[2,3,2,5],[22,3,22,5],[11,10,11,13],[9,10,10,13],[18,3,18,5],[19,3,19,5],[12,10,12,13],[13,10,13,13],[17,3,17,5],[14,10,14,13],[2,19,2,21],[20,17,20,18],[20,19,20,20],[18,15,18,16],[18,20,18,21],[6,11,6,19],[9,19,10,19],[9,20,10,20],[17,20,17,21],[17,15,17,16],[19,17,19,18],[19,19,19,20],[9,15,10,16],[9,14,10,14],[9,17,10,17],[9,18,10,18]]}
[{"$f":"LEN(L7)","v":39}]
[]
[null,null,null,null,null,null,null,null,null,null,null,null,null,null,null,null,null,null,null,"Periodo"]
[null,null,null,null,null,null,null,null,null,null,null,null,null,null,null,null,null,null,null,"Noviembre",null,2013,null,null,null,null,null,null,null,null,null,null,null,null,null,null,"▪ F01 ROI / ROA",3]
[null,null,null,null,null,null,null,null,null,null,null,null,null,null,null,null,null,null,null,null,null,null,null,null,null,null,null,null,null,null,null,null,null,null,null,null,"▪ F02 Ventas Netas Créditos de  Consumo",6]
[null,null,null,null,null,null,null,null,null,null,null,null,null,null,null,null,null,null,null,null,null,null,null,null,null,null,null,null,null,null,null,null,null,null,null,null,"▪ F03 Ventas Netas Tarjetas de Crédito (TC)",9]
[null,null,null,null,null,null,null,null,null,null,null,"[ F  ] Lograr Crecimiento en las Ventas",null,null,null,null,null,null,null,null,null,null,null,null,null,null,null,null,null,{"$f":"+V4&T4&\"0\"","v":"2013Noviembre0"},{"$f":"VLOOKUP(T4,AC19:AI30,7,FALSE)","v":"2013OCTUBRE0"},null,null,null,null,null,"▪ F04 N° Aperturas de Cuentas Corrientes (CCT)",12]
[null,null,null,null,null,null,null,null,null,null,null,null,null,null,null,null,null,null,null,null,null,null,null,null,null,null,null,null,null,{"$f":"DAY(EOMONTH(DATE(V4,2,1),0))","v":28},null,null,null,null,null,null,"▪ F05 Ventas Netas Cred. Hipotecario (CHIP)",15]
{"$rows_left_out":23}
{"sheet":"Panel_BCI","index":4,"n_rows":173,"n_cols":145,"rows_kept":173,"cut":false,"hidden":true,"merged":[[6,13,6,17],[52,3,54,3],[55,3,57,3],[58,3,60,3],[61,3,63,3],[37,3,39,3],[40,3,42,3],[43,3,45,3],[46,3,48,3],[22,3,24,3],[28,3,30,3],[25,3,27,3],[31,3,33,3],[34,3,36,3],[7,3,9,3],[10,3,12,3],[79,2,81,2],[70,3,72,3],[64,3,66,3],[52,2,54,2],[55,2,57,2],[58,2,60,2],[61,2,63,2],[64,2,66,2],[73,3,75,3],[79,3,81,3],[67,2,69,2],[67,3,69,3],[49,2,51,2],[76,3,78,3],[49,3,51,3],[70,2,72,2],[73,2,75,2],[76,2,78,2],[13,3,15,3],[16,3,18,3],[19,3,21,3],[136,10,136,13],[126,10,126,13],[7,2,9,2],[10,2,12,2],[13,2,15,2],[16,2,18,2],[19,2,21,2],[37,2,39,2],[40,2,42,2],[43,2,45,2],[46,2,48,2],[22,2,24,2],[28,2,30,2],[25,2,27,2],[31,2,33,2],[34,2,36,2]]}
[null,null,null,null,null,null,null,null,null,null,null,null,null,null,null,null,null,"NO BORRAR --->",null,{"$f":"IF(OR(T5=\"F\",T5=\"FD\"),\"\",+T2&T3)","v":"2013OCTUBRE"},{"$f":"IF(OR(U5=\"F\",U5=\"FD\"),\"\",+U2&U3)","v":"2013OCTUBRE"},{"$f":"IF(OR(V5=\"F\",V5=\"FD\"),\"\",+V2&V3)","v":"2013OCTUBRE"},{"$f":"IF(OR(W5=\"F\",W5=\"FD\"),\"\",+W2&W3)","v":"2013OCTUBRE"},{"$f":"IF(OR(X5=\"F\",X5=\"FD\"),\"\",+X2&X3)","v":""},"","2013OCTUBRE","2013OCTUBRE","2013OCTUBRE","2013OCTUBRE","2013OCTUBRE","","","2013OCTUBRE",{"$f":"IF(OR(AH5=\"F\",AH5=\"FD\"),\"\",+AH2&AH3)","v":"2013OCTUBRE"},"2013OCTUBRE","2013OCTUBRE","2013OCTUBRE","","","2013OCTUBRE","2013OCTUBRE","2013OCTUBRE","2013OCTUBRE","2013OCTUBRE","","","2013OCTUBRE","2013OCTUBRE",{"$f":"IF(OR(AW5=\"F\",AW5=\"FD\"),\"\",+AW2&AW3)","v":"2013OCTUBRE"},{"$f":"IF(OR(AX5=\"F\",AX5=\"FD\"),\"\",+AX2&AX3)","v":""},null,{"$f":"IF(OR(AZ5=\"F\",AZ5=\"FD\"),\"\",+AZ2&AZ3)","v":""},{"$f":"IF(OR(BA5=\"F\",BA5=\"FD\"),\"\",+BA2&BA3)","v":""},{"$f":"IF(OR(BB5=\"F\",BB5=\"FD\"),\"\",+BB2&BB3)","v":""},{"$f":"IF(OR(BC5=\"F\",BC5=\"FD\"),\"\",+BC2&BC3)","v":"2013NOVIEMBRE"},{"$f":"IF(OR(BD5=\"F\",BD5=\"FD\"),\"\",+BD2&BD3)","v":"2013NOVIEMBRE"},"2013NOVIEMBRE","2013NOVIEMBRE","2013NOVIEMBRE","","","2013NOVIEMBRE","2013NOVIEMBRE","2013NOVIEMBRE","2013NOVIEMBRE",{"$f":"IF(OR(BN5=\"F\",BN5=\"FD\"),\"\",+BN2&BN3)","v":"2013NOVIEMBRE"},{"$f":"IF(OR(BO5=\"F\",BO5=\"FD\"),\"\",+BO2&BO3)","v":""},"","2013NOVIEMBRE","2013NOVIEMBRE","2013NOVIEMBRE","2013NOVIEMBRE","2013NOVIEMBRE","","","2013NOVIEMBRE","2013NOVIEMBRE","2013NOVIEMBRE","2013NOVIEMBRE","2013NOVIEMBRE",{"$f":"IF(OR(CC5=\"F\",CC5=\"FD\"),\"\",+CC2&CC3)","v":""},null,{"$f":"IF(OR(CE5=\"F\",CE5=\"FD\"),\"\",+CE2&CE3)","v":""},{"$f":"IF(OR(CF5=\"F\",CF5=\"FD\"),\"\",+CF2&CF3)","v":"2013DICIEMBRE"},"2013DICIEMBRE","2013DICIEMBRE","2013DICIEMBRE","2013DICIEMBRE","","","2013DICIEMBRE",{"$f":"IF(OR(CN5=\"F\",CN5=\"FD\"),\"\",+CN2&CN3)","v":"2013DICIEMBRE"},"2013DICIEMBRE","2013DICIEMBRE","2013DICIEMBRE","","","2013DICIEMBRE","2013DICIEMBRE","2013DICIEMBRE","2013DICIEMBRE","2013DICIEMBRE","","","2013DICIEMBRE","2013DICIEMBRE","","2013DICIEMBRE","2013DICIEMBRE","","","2013DICIEMBRE","2013DICIEMBRE",null,{"$f":"IF(OR(DK5=\"F\",DK5=\"FD\"),\"\",+DK2&DK3)","v":""},"2014ENERO","2014ENERO","","","2014ENERO","2014ENERO","2014ENERO","2014ENERO","2014ENERO","","","2014ENERO","2014ENERO","2014ENERO","2014ENERO","2014ENERO","","","2014ENERO","2014ENERO","2014ENERO","2014ENERO","2014ENERO","","","2014ENERO","2014ENERO","2014ENERO","2014ENERO","2014ENERO"]
[null,null,null,null,null,null,null,null,null,null,null,null,null,null,null,null,null,"NO BORRAR --->",2013,{"$f":"+S2","v":2013},2013,2013,{"$f":"+V2","v":2013},2013,2013,2013,2013,2013,2013,2013,2013,2013,2013,2013,2013,2013,2013,2013,2013,2013,2013,2013,2013,2013,2013,2013,2013,2013,2013,2013,2013,{"$f":"+AY2","v":2013},2013,2013,2013,2013,2013,2013,2013,2013,2013,2013,2013,2013,2013,2013,2013,2013,{"$f":"+BN2","v":2013},{"$f":"+BQ2","v":2013},2013,2013,2013,2013,2013,{"$f":"+BU2","v":2013},{"$f":"+BX2","v":2013},2013,2013,2013,2013,2013,{"$f":"+CD2","v":2013},2013,2013,2013,2013,2013,2013,2013,2013,2013,2013,2013,2013,2013,2013,2013,2013,{"$f":"+CS2","v":2013},{"$f":"+CV2","v":2013},2013,2013,2013,2013,2013,{"$f":"+CZ2","v":2013},{"$f":"+DC2","v":2013},2013,2013,2013,2013,{"$f":"+DG2","v":2013},2014,{"$f":"+DJ2","v":2014},2014,2014,2014,2014,2014,2014,2014,2014,2014,2014,2014,2014,2014,2014,2014,2014,{"$f":"+DY2","v":2014},{"$f":"+EB2","v":2014},2014,2014,2014,2014,2014,{"$f":"+EF2","v":2014},{"$f":"+EI2","v":2014},2014,2014,2014,2014,{"$f":"+EM2","v":2014}]
[null,null,null,null,1,2,3,4,5,6,7,null,null,null,null,null,null,"NO BORRAR --->","OCTUBRE","OCTUBRE","OCTUBRE","OCTUBRE",{"$f":"+V3","v":"OCTUBRE"},{"$f":"+W3","v":"OCTUBRE"},"OCTUBRE","OCTUBRE","OCTUBRE",{"$f":"+AA3","v":"OCTUBRE"},{"$f":"+AB3","v":"OCTUBRE"},{"$f":"+AC3","v":"OCTUBRE"},"OCTUBRE","OCTUBRE","OCTUBRE","OCTUBRE",{"$f":"+AH3","v":"OCTUBRE"},{"$f":"+AI3","v":"OCTUBRE"},{"$f":"+AH3","v":"OCTUBRE"},"OCTUBRE","OCTUBRE","OCTUBRE","OCTUBRE",{"$f":"+AO3","v":"OCTUBRE"},{"$f":"+AP3","v":"OCTUBRE"},{"$f":"+AO3","v":"OCTUBRE"},{"$f":"+AR3","v":"OCTUBRE"},"OCTUBRE","OCTUBRE","OCTUBRE",{"$f":"+AV3","v":"OCTUBRE"},{"$f":"+AW3","v":"OCTUBRE"},"NOVIEMBRE",{"$f":"+AY3","v":"NOVIEMBRE"},"NOVIEMBRE","NOVIEMBRE","NOVIEMBRE","NOVIEMBRE","NOVIEMBRE","NOVIEMBRE","NOVIEMBRE","NOVIEMBRE","NOVIEMBRE","NOVIEMBRE","NOVIEMBRE","NOVIEMBRE","NOVIEMBRE","NOVIEMBRE","NOVIEMBRE","NOVIEMBRE",{"$f":"+BN3","v":"NOVIEMBRE"},"NOVIEMBRE","NOVIEMBRE","NOVIEMBRE","NOVIEMBRE","NOVIEMBRE","NOVIEMBRE",{"$f":"+BU3","v":"NOVIEMBRE"},"NOVIEMBRE","NOVIEMBRE","NOVIEMBRE","NOVIEMBRE","NOVIEMBRE","DICIEMBRE",{"$f":"+CD3","v":"DICIEMBRE"},"DICIEMBRE","DICIEMBRE","DICIEMBRE","DICIEMBRE","DICIEMBRE","DICIEMBRE","DICIEMBRE","DICIEMBRE","DICIEMBRE","DICIEMBRE","DICIEMBRE","DICIEMBRE","DICIEMBRE","DICIEMBRE","DICIEMBRE","DICIEMBRE",{"$f":"+CS3","v":"DICIEMBRE"},"DICIEMBRE","DICIEMBRE","DICIEMBRE","DICIEMBRE","DICIEMBRE","DICIEMBRE",{"$f":"+CZ3","v":"DICIEMBRE"},"DICIEMBRE","DICIEMBRE","DICIEMBRE","DICIEMBRE","DICIEMBRE",{"$f":"+DG3","v":"DICIEMBRE"},"ENERO",{"$f":"+DJ3","v":"ENERO"},"ENERO","ENERO","ENERO","ENERO","ENERO","ENERO","ENERO","ENERO","ENERO","ENERO","ENERO","ENERO","ENERO","ENERO","ENERO","ENERO",{"$f":"+DY3","v":"ENERO"},"ENERO","ENERO","ENERO","ENERO","ENERO","ENERO",{"$f":"+EF3","v":"ENERO"},"ENERO","ENERO","ENERO","ENERO","ENERO",{"$f":"+EM3","v":"ENERO"}]
[null,null,null,null,null,null,null,null,null,null,null,null,null,null,null,null,null,"NO BORRAR --->",0,1,{"$f":"+T4+1","v":2},{"$f":"+U4+1","v":3},{"$f":"+V4+1","v":4},{"$f":"+W4+1","v":5},{"$f":"+X4+1","v":6},7,8,9,10,11,12,13,14,15,16,17,18,{"$f":"+AK4+1","v":19},20,21,22,23,24,{"$f":"+AO4+3","v":25},{"$f":"+AR4+1","v":26},27,28,29,30,31,0,1,{"$f":"+AZ4+1","v":2},3,4,5,6,7,8,9,10,11,12,13,14,15,16,17,18,19,20,21,22,23,24,{"$f":"+BU4+3","v":25},{"$f":"+BX4+1","v":26},{"$f":"+BY4+1","v":27},{"$f":"+BZ4+1","v":28},{"$f":"+CA4+1","v":29},{"$f":"+CB4+1","v":30},0,1,{"$f":"+CE4+1","v":2},3,4,5,6,7,8,9,10,11,12,13,14,15,16,17,18,19,20,21,22,23,24,{"$f":"+CZ4+3","v":25},{"$f":"+DC4+1","v":26},27,28,29,30,31,0,1,{"$f":"+DK4+1","v":2},3,4,5,6,7,8,9,10,11,12,13,14,15,16,17,18,19,20,21,22,23,24,{"$f":"+EF4+3","v":25},{"$f":"+EI4+1","v":26},27,28,29,30,31]
[null,null,null,null,null,null,null,null,null,null,null,null,"Filas AUXILIARES",null,null,null,null,"NO BORRAR --->",null,null,null,null,null,"FD","FD",null,null,null,null,null,"FD","FD",null,null,null,null,null,"FD","FD",null,null,null,null,null,"FD","FD",null,null,null,"F",null,"F","FD","FD",null,null,null,null,null,"FD","FD",null,null,null,null,null,"FD","FD",null,null,null,null,null,"FD","FD",null,null,null,null,null,"FD",null,"FD",null,null,null,null,null,"FD","FD",null,null,null,null,null,"FD","FD",null,null,null,null,null,"FD","FD",null,null,"F",null,null,"FD","FD",null,null,null,"F",null,null,"FD","FD",null,null,null,null,null,"FD","FD",null,null,null,null,null,"FD","FD",null,null,null,null,null,"FD","FD"]
[null,null,"Objetivo Estratégico","N_INDICADORES","INDICADOR","FRECUENCIA","% intraObjetivo","META","UNIDAD","RESPONSABLE","Perspectiva",null,1,1,2,3,4,5,{"$f":"+S2&S3&S4","v":"2013OCTUBRE0"},{"$f":"IF(OR(T5=\"F\",T5=\"FD\"),\"\",+T2&T3&T4)","v":"2013OCTUBRE1"},{"$f":"IF(OR(U5=\"F\",U5=\"FD\"),\"\",+U2&U3&U4)","v":"2013OCTUBRE2"},"2013OCTUBRE3","2013OCTUBRE4","","","2013OCTUBRE7",{"$f":"IF(OR(AA5=\"F\",AA5=\"FD\"),\"\",+AA2&AA3&AA4)","v":"2013OCTUBRE8"},"2013OCTUBRE9","2013OCTUBRE10","2013OCTUBRE11","","","2013OCTUBRE14","2013OCTUBRE15","2013OCTUBRE16","2013OCTUBRE17","2013OCTUBRE18","","","2013OCTUBRE21","2013OCTUBRE22","2013OCTUBRE23","2013OCTUBRE24","2013OCTUBRE25","","","2013OCTUBRE28","2013OCTUBRE29","2013OCTUBRE30","",{"$f":"+AY2&AY3&AY4","v":"2013NOVIEMBRE0"},{"$f":"IF(OR(AZ5=\"F\",AZ5=\"FD\"),\"\",+AZ2&AZ3&AZ4)","v":""},{"$f":"IF(OR(BA5=\"F\",BA5=\"FD\"),\"\",+BA2&BA3&BA4)","v":""},"","2013NOVIEMBRE4","2013NOVIEMBRE5","2013NOVIEMBRE6","2013NOVIEMBRE7","2013NOVIEMBRE8","","","2013NOVIEMBRE11","2013NOVIEMBRE12","2013NOVIEMBRE13","2013NOVIEMBRE14","2013NOVIEMBRE15","","","2013NOVIEMBRE18","2013NOVIEMBRE19","2013NOVIEMBRE20","2013NOVIEMBRE21","2013NOVIEMBRE22","","","2013NOVIEMBRE25","2013NOVIEMBRE26","2013NOVIEMBRE27","2013NOVIEMBRE28","2013NOVIEMBRE29","",{"$f":"+CD2&CD3&CD4","v":"2013DICIEMBRE0"},{"$f":"IF(OR(CE5=\"F\",CE5=\"FD\"),\"\",+CE2&CE3&CE4)","v":""},{"$f":"IF(OR(CF5=\"F\",CF5=\"FD\"),\"\",+CF2&CF3&CF4)","v":"2013DICIEMBRE2"},"2013DICIEMBRE3","2013DICIEMBRE4","2013DICIEMBRE5","2013DICIEMBRE6","","","2013DICIEMBRE9","2013DICIEMBRE10","2013DICIEMBRE11","2013DICIEMBRE12","2013DICIEMBRE13","","","2013DICIEMBRE16","2013DICIEMBRE17","2013DICIEMBRE18","2013DICIEMBRE19","2013DICIEMBRE20","","","2013DICIEMBRE23","2013DICIEMBRE24","","2013DICIEMBRE26","2013DICIEMBRE27","","",{"$f":"IF(OR(DH5=\"F\",DH5=\"FD\"),\"\",+DH2&DH3&DH4)","v":"2013DICIEMBRE30"},{"$f":"IF(OR(DI5=\"F\",DI5=\"FD\"),\"\",+DI2&DI3&DI4)","v":"2013DICIEMBRE31"},{"$f":"+DJ2&DJ3&DJ4","v":"2014ENERO0"},{"$f":"IF(OR(DK5=\"F\",DK5=\"FD\"),\"\",+DK2&DK3&DK4)","v":""},{"$f":"IF(OR(DL5=\"F\",DL5=\"FD\"),\"\",+DL2&DL3&DL4)","v":"2014ENERO2"},"2014ENERO3","","","2014ENERO6","2014ENERO7","2014ENERO8","2014ENERO9","2014ENERO10","","","2014ENERO13","2014ENERO14","2014ENERO15","2014ENERO16","2014ENERO17","","","2014ENERO20","2014ENERO21","2014ENERO22","2014ENERO23","2014ENERO24","","","2014ENERO27","2014ENERO28","2014ENERO29","2014ENERO30","2014ENERO31"]
[null,null,null,null,null,null,null,null,null,null,null,null,2,"SEMANAS"]
[null,1,"Obtener Rentabilidad Operativa para  Sucursal Bancaria",1,"▪ F01 ROI / ROA","Mensual",100,1.51,"%","JOF","FINANCIERA",null,3,{"$f":"+E8","v":"▪ F01 ROI / ROA"},{"$f":"+I8","v":"%"},"META",{"$f":"+F8","v":"Mensual"},{"$f":"+N8&P8&Q8","v":"▪ F01 ROI / ROAMETAMensual"},{"$f":"0.0151","v":1.5100000000000001E-2},{"$f":"IF(OR(T$5=\"F\",T$5=\"FD\"),0,$S8)","v":1.5100000000000001E-2},{"$f":"IF(OR(U$5=\"F\",U$5=\"FD\"),0,$S8)","v":1.5100000000000001E-2},1.5100000000000001E-2,1.5100000000000001E-2,{"$f":"IF(OR(X$5=\"F\",X$5=\"FD\"),0,$S8)","v":0},0,1.5100000000000001E-2,1.5100000000000001E-2,1.5100000000000001E-2,1.5100000000000001E-2,1.5100000000000001E-2,0,0,1.5100000000000001E-2,1.5100000000000001E-2,1.5100000000000001E-2,1.5100000000000001E-2,1.5100000000000001E-2,0,0,1.5100000000000001E-2,1.5100000000000001E-2,1.5100000000000001E-2,1.5100000000000001E-2,1.5100000000000001E-2,0,0,1.5100000000000001E-2,1.5100000000000001E-2,1.5100000000000001E-2,0,{"$f":"0.0151","v":1.5100000000000001E-2},{"$f":"IF(OR(AZ$5=\"F\",AZ$5=\"FD\"),0,$S8)","v":0},{"$f":"IF(OR(BA$5=\"F\",BA$5=\"FD\"),0,$S8)","v":0},0,1.5100000000000001E-2,{"$f":"IF(OR(BD$5=\"F\",BD$5=\"FD\"),0,$S8)","v":1.5100000000000001E-2},1.5100000000000001E-2,1.5100000000000001E-2,1.5100000000000001E-2,0,0,1.5100000000000001E-2,1.5100000000000001E-2,1.5100000000000001E-2,1.5100000000000001E-2,1.5100000000000001E-2,0,0,1.5100000000000001E-2,1.5100000000000001E-2,1.5100000000000001E-2,1.5100000000000001E-2,1.5100000000000001E-2,0,0,1.5100000000000001E-2,1.5100000000000001E-2,1.5100000000000001E-2,1.5100000000000001E-2,1.5100000000000001E-2,0,{"$f":"0.0151","v":1.5100000000000001E-2},{"$f":"IF(OR(CE$5=\"F\",CE$5=\"FD\"),0,$S8)","v":0},{"$f":"IF(OR(CF$5=\"F\",CF$5=\"FD\"),0,$S8)","v":1.5100000000000001E-2},1.5100000000000001E-2,1.5100000000000001E-2,{"$f":"IF(OR(CI$5=\"F\",CI$5=\"FD\"),0,$S8)","v":1.5100000000000001E-2},1.5100000000000001E-2,0,0,1.5100000000000001E-2,1.5100000000000001E-2,1.5100000000000001E-2,1.5100000000000001E-2,1.5100000000000001E-2,0,0,1.5100000000000001E-2,1.5100000000000001E-2,1.5100000000000001E-2,1.5100000000000001E-2,1.5100000000000001E-2,0,0,1.5100000000000001E-2,1.5100000000000001E-2,0,1.5100000000000001E-2,1.5100000000000001E-2,0,0,1.5100000000000001E-2,1.5100000000000001E-2,{"$f":"0.0151","v":1.5100000000000001E-2},{"$f":"IF(OR(DK$5=\"F\",DK$5=\"FD\"),0,$S8)","v":0},{"$f":"IF(OR(DL$5=\"F\",DL$5=\"FD\"),0,$S8)","v":1.5100000000000001E-2},1.5100000000000001E-2,0,{"$f":"IF(OR(DO$5=\"F\",DO$5=\"FD\"),0,$S8)","v":0},1.5100000000000001E-2,1.5100000000000001E-2,1.5100000000000001E-2,1.5100000000000001E-2,1.5100000000000001E-2,0,0,1.5100000000000001E-2,1.5100000000000001E-2,1.5100000000000001E-2,1.5100000000000001E-2,1.5100000000000001E-2,0,0,1.5100000000000001E-2,1.5100000000000001E-2,1.5100000000000001E-2,1.5100000000000001E-2,1.5100000000000001E-2,0,0,1.5100000000000001E-2,1.5100000000000001E-2,1.5100000000000001E-2,1.5100000000000001E-2,1.5100000000000001E-2]
{"$rows_left_out":166}
{"sheet":"Hoja6","index":5,"n_rows":429,"n_cols":17,"rows_kept":429,"cut":false,"hidden":true,"merged":[]}
["Etiquetas de fila","Cuenta de 2"]
[1,2]
["Total general",2]
[]
[]
[]
[]
[]
{"$rows_left_out":422}
{"sheet":"Hoja7","index":6,"n_rows":68,"n_cols":5,"rows_kept":68,"cut":false,"hidden":true,"merged":[]}
[]
[]
[]
[]
[]
[]
[]
[]
{"$rows_left_out":61}
{"sheet":"F02","index":7,"n_rows":85,"n_cols":78,"rows_kept":85,"cut":false,"hidden":true,"merged":[[0,54,0,77],[1,54,1,65],[1,66,1,77],[1,1,1,12],[1,13,1,24],[0,1,0,24],[0,28,0,51],[1,28,1,39],[1,40,1,51]]}
["▪ Ventas Netas Cred. Consumo","VENTAS DIARIAS REALES",null,null,null,null,null,null,null,null,null,null,null,null,null,null,null,null,null,null,null,null,null,null,null,null,null,"▪ Ventas Netas Tarjetas de Crédito (TC)","VENTAS DIARIAS REALES",null,null,null,null,null,null,null,null,null,null,null,null,null,null,null,null,null,null,null,null,null,null,null,null,"▪  N° Cuentas Corrientes Aperturadas","VENTAS DIARIAS REALES"]
[null,2013,null,null,null,null,null,null,null,null,null,null,null,2014,null,null,null,null,null,null,null,null,null,null,null,null,null,null,2013,null,null,null,null,null,null,null,null,null,null,null,2014,null,null,null,null,null,null,null,null,null,null,null,null,null,2013,null,null,null,null,null,null,null,null,null,null,null,2014]
[null,1,2,3,4,5,6,7,8,9,10,11,12,1,2,3,4,5,6,7,8,9,10,11,12,null,null,null,1,2,3,4,5,6,7,8,9,10,11,12,1,2,3,4,5,6,7,8,9,10,11,12,null,null,1,2,3,4,5,6,7,8,9,10,11,12,1,2,3,4,5,6,7,8,9,10,11,12]
[null,"Enero","Febrero","Marzo","Abril","Mayo","Junio","Julio","Agosto","Septiembre","Octubre","Noviembre","Diciembre","Enero","Febrero","Marzo","Abril","Mayo","Junio","Julio","Agosto","Septiembre","Octubre","Noviembre","Diciembre",null,null,null,"Enero","Febrero","Marzo","Abril","Mayo","Junio","Julio","Agosto","Septiembre","Octubre","Noviembre","Diciembre","Enero","Febrero","Marzo","Abril","Mayo","Junio","Julio","Agosto","Septiembre","Octubre","Noviembre","Diciembre",null,null,"Enero","Febrero","Marzo","Abril","Mayo","Junio","Julio","Agosto","Septiembre","Octubre","Noviembre","Diciembre","Enero","Febrero","Marzo","Abril","Mayo","Junio","Julio","Agosto","Septiembre","Octubre","Noviembre","Diciembre"]
[null,{"$f":"+\"2013\"&B4","v":"2013Enero"},"2013Febrero","2013Marzo","2013Abril","2013Mayo","2013Junio","2013Julio","2013Agosto","2013Septiembre","2013Octubre","2013Noviembre","2013Diciembre",{"$f":"+\"2014\"&N4","v":"2014Enero"},"2014Febrero","2014Marzo","2014Abril","2014Mayo","2014Junio","2014Julio","2014Agosto","2014Septiembre","2014Octubre","2014Noviembre","2014Diciembre",null,null,null,{"$f":"+\"2013\"&AC4","v":"2013Enero"},"2013Febrero","2013Marzo","2013Abril","2013Mayo","2013Junio","2013Julio","2013Agosto","2013Septiembre","2013Octubre","2013Noviembre","2013Diciembre",{"$f":"+\"2014\"&AO4","v":"2014Enero"},"2014Febrero","2014Marzo","2014Abril","2014Mayo","2014Junio","2014Julio","2014Agosto","2014Septiembre","2014Octubre","2014Noviembre","2014Diciembre",null,null,{"$f":"+\"2013\"&BC4","v":"2013Enero"},"2013Febrero","2013Marzo","2013Abril","2013Mayo","2013Junio","2013Julio","2013Agosto","2013Septiembre","2013Octubre","2013Noviembre","2013Diciembre",{"$f":"+\"2014\"&BO4","v":"2014Enero"},"2014Febrero","2014Marzo","2014Abril","2014Mayo","2014Junio","2014Julio","2014Agosto","2014Septiembre","2014Octubre","2014Noviembre","2014Diciembre"]
[1,{"$f":"RANDBETWEEN(10,180)/100","v":0.64},{"$f":"RANDBETWEEN(10,180)/100","v":1.63},0.28000000000000003,1.53,0.91,1.7,1.39,0.2,1.1299999999999999,0.79,1.41,0.57999999999999996,{"$f":"RANDBETWEEN(10,180)/100","v":1.78},0.74,0.13,1.1200000000000001,0.94,0.71,0.69,1.25,0.75,0.77,0.9,0.24,null,null,1,{"$f":"ROUND(RANDBETWEEN(10,180)/100,0)","v":0},{"$f":"ROUND(RANDBETWEEN(10,180)/100,0)","v":2},2,{"$f":"ROUND(RANDBETWEEN(10,200)/100,0)","v":1},1,1,1,1,0,1,1,1,{"$f":"ROUND(RANDBETWEEN(10,180)/100,0)","v":0},1,1,{"$f":"ROUND(RANDBETWEEN(10,200)/100,0)","v":1},2,0,1,1,1,1,1,1,null,1,{"$f":"RANDBETWEEN(1,2)","v":2},{"$f":"RANDBETWEEN(1,2)","v":2},1,2,2,1,1,1,2,2,1,2,{"$f":"RANDBETWEEN(1,2)","v":1},1,2,1,1,1,1,1,2,2,2,{"$f":"RANDBETWEEN(1,2)","v":2}]
[2,{"$f":"RANDBETWEEN(10,180)/100","v":1.71},0.82,1.22,0.74,0.7,1.56,0.95,1.35,1.58,1.57,0.74,1.38,{"$f":"RANDBETWEEN(10,180)/100","v":1.54},0.34,1.78,1.0900000000000001,1.77,1.51,0.72,0.78,1.66,1.8,0.9,0.57999999999999996,null,null,2,{"$f":"ROUND(RANDBETWEEN(10,180)/100,0)","v":1},2,0,{"$f":"ROUND(RANDBETWEEN(10,200)/100,0)","v":0},0,2,1,1,1,0,1,1,{"$f":"ROUND(RANDBETWEEN(10,180)/100,0)","v":0},1,1,{"$f":"ROUND(RANDBETWEEN(10,200)/100,0)","v":1},1,2,1,1,1,1,1,1,null,2,{"$f":"RANDBETWEEN(1,2)","v":2},{"$f":"RANDBETWEEN(1,2)","v":1},1,2,1,2,1,2,1,1,1,1,{"$f":"RANDBETWEEN(1,2)","v":1},1,1,1,1,2,2,2,2,1,2,{"$f":"RANDBETWEEN(1,2)","v":2}]
[3,0.83,0.68,0.3,0.28999999999999998,1.48,1.1599999999999999,1.35,0.11,1.1000000000000001,1.1299999999999999,1.64,0.67,1.1499999999999999,0.94,0.98,1.52,0.4,1.02,1.1100000000000001,0.77,0.13,1.34,1.46,1.32,null,null,3,2,0,2,1,0,1,0,1,1,1,0,1,1,2,1,1,1,2,1,2,1,1,1,1,null,3,1,2,2,1,2,2,1,2,2,1,2,2,1,1,1,1,2,2,1,1,1,1,1,2]
{"$rows_left_out":78}
{"sheet":"Obj_Ejecutivos","index":8,"n_rows":12,"n_cols":10,"rows_kept":12,"cut":false,"hidden":true,"merged":[]}
[]
[null,null,null,null,null,"ejecutivo","All"]
[]
[null,null,null,null,null,"Etiquetas de fila","Suma de Cumplimiento","Suma de Gestion _Campaña","Suma de cumpliento_Visita","Suma de cumpliento _Contacto Efectivo"]
[null,null,null,null,null,"CAZAMOR",1,0.52173913043478259,0,1]
[null,null,null,null,null,"EMUNOZB",1,0.95238095238095233,0,1]
[null,null,null,null,null,"FDIAZME",0.75,1,1,0.5]
[null,null,null,null,null,"GLETELI",0.83333333333333326,0.2,0.66666666666666663,1]
{"$rows_left_out":4}